Reaction Details
TargetCannabinoid receptor 2
LigandBDBM50399530
Substrate/Competitorn/a
Meas. Tech.Radioligand Displacement Assay (CP55940)
Ki 20000±n/a nM
Citation Maitra, RFulp, ABZhang, YSeltzman, HH Peripherally restricted diphenyl purine derivatives US Patent US9187480 Publication Date 11/17/2015
 
Cannabinoid receptor 2
Name:Cannabinoid receptor 2
Type:G Protein-Coupled Receptor (GPCR)
Mol. Mass.:39690.94
Organism:Homo sapiens (Human)
Description:P34972
Residue:360
BDBM50399530
NameBDBM50399530
Synonyms:CHEMBL2180219 | US9187480, 3-tert-butyl-1-{1-[8-(2-chlorophenyl)-9-(4-chlorophenyl)-9H-purin-6-yl]-4-phenylpiperidin-4-yl}urea
TypeSmall organic molecule
Emp. Form.C33H33Cl2N7O
Mol. Mass.614.567
SMILESCC(C)(C)NC(=O)NC1(CCN(CC1)c1ncnc2n(c(nc12)-c1ccccc1Cl)-c1ccc(Cl)cc1)c1ccccc1