Reaction Details
TargetCarboxylic ester hydrolase
LigandBDBM10620
Substrate/Competitorn/a
Meas. Tech.AChE and BChE Inhibition Assay
pH8±n/a
IC50 7.72e+3± 2e+1 nM
Commentsextracted
Citation Najafi, ZSaeedi, MMahdavi, MSabourian, RKhanavi, MTehrani, MBMoghadam, FHEdraki, NKarimpor-Razkenari, ESharifzadeh, MForoumadi, AShafiee, AAkbarzadeh, T Design and synthesis of novel anti-Alzheimer's agents: Acridine-chromenone and quinoline-chromenone hybrids. Bioorg Chem67:84-94 (2016) 
 
Carboxylic ester hydrolase
Name:Carboxylic ester hydrolase
Type:Protein
Mol. Mass.:68842.83
Organism:Equus caballus (Horse)
Description:Q9N1N9
Residue:602
BDBM10620
NameBDBM10620
Synonyms:(S)-3-(1-(dimethylamino)ethyl)phenyl ethyl(methyl)carbamate 3-(1-(dimethylamino)ethyl)phenyl ethyl(methyl)carbamate CHEMBL636 Ethyl-methyl-carbamic acid 3-((R)-1-dimethylamino-ethyl)-phenyl ester Ethyl-methyl-carbamic acid 3-(1-dimethylamino-ethyl)-phenyl ester Rivastigmine SDZ-212-713 | SDZ-ENA-713
TypeSmall organic molecule
Emp. Form.C14H22N2O2
Mol. Mass.250.3367
SMILES[H][C@@](C)(N(C)C)c1cccc(OC(=O)N(C)CC)c1