Reaction Details
TargetTrifunctional purine biosynthetic protein adenosine-3
LigandBDBM192708
Substrate/Competitorn/a
Meas. Tech.GAR Transformylase Inhibition Assay
pH7.5±n/a
IC50 1067±271 nM
Commentsextracted
Citation Deis, SMDoshi, AHou, ZMatherly, LHGangjee, ADann, CE Structural and Enzymatic Analysis of Tumor-Targeted Antifolates That Inhibit Glycinamide Ribonucleotide Formyltransferase. Biochemistry55:4574-82 (2016) 
 
Trifunctional purine biosynthetic protein adenosine-3
Name:Trifunctional purine biosynthetic protein adenosine-3
Type:Protein
Mol. Mass.:107768.47
Organism:Homo sapiens (Human)
Description:P22102
Residue:1010
BDBM192708
NameBDBM192708
Synonyms:AGF50
TypeSmall organic molecule
Emp. Form.C22H26N4O6S
Mol. Mass.474.53
SMILESNc1nc2sc(CCCCc3ccc(cc3)C(=O)N[C@@H](CCC(O)=O)C(O)O)cc2c(=O)[nH]1