Reaction Details
TargetTrifunctional purine biosynthetic protein adenosine-3
LigandBDBM192709
Substrate/Competitorn/a
Meas. Tech.GAR Transformylase Inhibition Assay
pH7.5±n/a
IC50 7±1 nM
Commentsextracted
Citation Deis, SMDoshi, AHou, ZMatherly, LHGangjee, ADann, CE Structural and Enzymatic Analysis of Tumor-Targeted Antifolates That Inhibit Glycinamide Ribonucleotide Formyltransferase. Biochemistry55:4574-82 (2016) 
 
Trifunctional purine biosynthetic protein adenosine-3
Name:Trifunctional purine biosynthetic protein adenosine-3
Type:Protein
Mol. Mass.:107768.47
Organism:Homo sapiens (Human)
Description:P22102
Residue:1010
BDBM192709
NameBDBM192709
Synonyms:AGF117
TypeSmall organic molecule
Emp. Form.C21H25N5O6S
Mol. Mass.475.518
SMILESCc1sc(cc1CCCCc1cc2c(nc(N)[nH]c2=O)[nH]1)C(=O)N[C@@H](CCC(O)=O)C(O)=O