Reaction Details
TargetSerine/threonine-protein kinase/endoribonuclease IRE1 [547-977]
LigandBDBM50436850
Substrate/Competitorn/a
Meas. Tech.Kinase Assay
pH7.5±n/a
IC50 3.7e+3±n/a nM
Commentsextracted
Citation Feldman, HCTong, MWang, LMeza-Acevedo, RGobillot, TALebedev, IGliedt, MJHari, SBMitra, AKBackes, BJPapa, FRSeeliger, MAMaly, DJ Structural and Functional Analysis of the Allosteric Inhibition of IRE1a with ATP-Competitive Ligands. ACS Chem Biol11:2195-205 (2016) 
 
Serine/threonine-protein kinase/endoribonuclease IRE1 [547-977]
Name:Serine/threonine-protein kinase/endoribonuclease IRE1 [547-977]
Type:Protein
Mol. Mass.:49232.75
Organism:Homo sapiens (Human)
Description:Cytosolic kinase and RNase domains of human IRE1α (residues 547-977) in SF9 insect cells
Residue:431
BDBM50436850
NameBDBM50436850
Synonyms:CERITINIB LDK378 US10618884, Example 16 | US9809572, Example 16
TypeSmall organic molecule
Emp. Form.C28H36ClN5O3S
Mol. Mass.558.135
SMILESCC(C)Oc1cc(C2CCNCC2)c(C)cc1Nc1ncc(Cl)c(Nc2ccccc2S(=O)(=O)C(C)C)n1