Reaction Details
TargetSeed linoleate 13S-lipoxygenase-1
LigandBDBM192765
Substrate/Competitorn/a
Meas. Tech.Lipo-oxygenase Inhibitory Assay
pH7±n/a
Temperature298.15±n/a K
IC50 5.2e+2± 1e+2 nM
Commentsextracted
Citation Jabbari, ASadeghian, HSalimi, AMousavian, MSeyedi, SMBakavoli, M 2-Prenylated m-dimethoxybenzenes as potent inhibitors of 15-lipo-oxygenase: inhibitory mechanism and SAR studies. Chem Biol Drug Des88:460-9 (2016) 
 
Seed linoleate 13S-lipoxygenase-1
Name:Seed linoleate 13S-lipoxygenase-1
Type:Enzyme
Mol. Mass.:94365.66
Organism:Glycine max (soybean)
Description:n/a
Residue:839
BDBM192765
NameBDBM192765
Synonyms:1,3-Dimethoxy-5-methyl-2-((2E,6E)-3,7,11-trimethyldodeca-2,6,10-trien-1-yl)benzene (11)
TypeSmall organic molecule
Emp. Form.C24H36O2
Mol. Mass.356.5414
SMILES[#6]-[#8]-c1cc(-[#6])cc(-[#8]-[#6])c1-[#6]\[#6]=[#6](/[#6])-[#6]-[#6]\[#6]=[#6](/[#6])-[#6]-[#6]\[#6]=[#6](\[#6])-[#6]