Reaction Details
TargetTyrosine-protein kinase JAK3 [781-1124]
LigandBDBM192811
Substrate/Competitorn/a
Meas. Tech.Phosphorylation Assay
pH7.5±n/a
Temperature25±n/a K
IC50 1±n/a nM
Citation Goldstein, DMBrameld, KAVerner, E Azaindole derivatives as tyrosine kinase inhibitors US Patent US9187487 Publication Date 11/17/2015
 
Tyrosine-protein kinase JAK3 [781-1124]
Name:Tyrosine-protein kinase JAK3 [781-1124]
Type:n/a
Mol. Mass.:38772.27
Organism:Homo sapiens (Human)
Description:P52333[781-1124]
Residue:344
BDBM192811
NameBDBM192811
Synonyms:US9187487, 76
TypeSmall organic molecule
Emp. Form.C26H28N6O2
Mol. Mass.456.5395
SMILESCC(C)(C)C(=O)c1c[nH]c2ncc(Nc3ccc(C=C(C#N)C(=O)N4CCCCC4)cc3)nc12