Reaction Details
TargetTyrosine-protein kinase JAK3 [781-1124]
LigandBDBM192812
Substrate/Competitorn/a
Meas. Tech.Phosphorylation Assay
pH7.5±n/a
Temperature25±n/a K
IC50 1±n/a nM
Citation Goldstein, DMBrameld, KAVerner, E Azaindole derivatives as tyrosine kinase inhibitors US Patent US9187487 Publication Date 11/17/2015
 
Tyrosine-protein kinase JAK3 [781-1124]
Name:Tyrosine-protein kinase JAK3 [781-1124]
Type:n/a
Mol. Mass.:38772.27
Organism:Homo sapiens (Human)
Description:P52333[781-1124]
Residue:344
BDBM192812
NameBDBM192812
Synonyms:US9187487, 77
TypeSmall organic molecule
Emp. Form.C23H24N6O2
Mol. Mass.416.4757
SMILESCCNC(=O)C(=Cc1ccc(Nc2cnc3[nH]cc(C(=O)C(C)(C)C)c3n2)cc1)C#N