Reaction Details
TargetPoly [ADP-ribose] polymerase tankyrase-1 [1068-1325]
LigandBDBM192901
Substrate/Competitorn/a
Meas. Tech.Chemiluminescent PARP Assay
IC50 24±n/a nM
Citation Ashworth, ALord, CJElliot, RJNiculescu-Duvaz, DPorter, RBoffey, RJBayford, MJFirth-Clark, SJarvis, ANPerrior, TRKey, RE 3-aryl-5-substituted-isoquinolin-1-one compounds and their therapeutic use US Patent US9193689 Publication Date 11/24/2015
 
Poly [ADP-ribose] polymerase tankyrase-1 [1068-1325]
Name:Poly [ADP-ribose] polymerase tankyrase-1 [1068-1325]
Type:Protein
Mol. Mass.:29381.76
Organism:Homo sapiens (Human)
Description:PDB: 2RF5
Residue:258
BDBM192901
NameBDBM192901
Synonyms:US9193689, REF-3
TypeSmall organic molecule
Emp. Form.C19H20N4O
Mol. Mass.320.3883
SMILESCN1CCN(CC1)c1ccc(cn1)-c1cc2ccccc2c(=O)[nH]1