Reaction Details
TargetPoly [ADP-ribose] polymerase tankyrase-1 [1068-1325]
LigandBDBM192908
Substrate/Competitorn/a
Meas. Tech.Chemiluminescent PARP Assay
IC50 26±n/a nM
Citation Ashworth, ALord, CJElliot, RJNiculescu-Duvaz, DPorter, RBoffey, RJBayford, MJFirth-Clark, SJarvis, ANPerrior, TRKey, RE 3-aryl-5-substituted-isoquinolin-1-one compounds and their therapeutic use US Patent US9193689 Publication Date 11/24/2015
 
Poly [ADP-ribose] polymerase tankyrase-1 [1068-1325]
Name:Poly [ADP-ribose] polymerase tankyrase-1 [1068-1325]
Type:Protein
Mol. Mass.:29381.76
Organism:Homo sapiens (Human)
Description:PDB: 2RF5
Residue:258
BDBM192908
NameBDBM192908
Synonyms:US9193689, IQ-220
TypeSmall organic molecule
Emp. Form.C21H22N4O2
Mol. Mass.362.425
SMILESCN1CCN(CC1)C(=O)c1ccc(cn1)-c1cc2c(C)cccc2c(=O)[nH]1