Reaction Details
TargetLysosomal Pro-X carboxypeptidase
LigandBDBM193272
Substrate/Competitorn/a
Meas. Tech.Enzyme Assay
Ki 110800±n/a nM
Citation Shariat-Madar, ZRimoldi, JMGadepalli, RS Selective inhibitors of prolylcarboxypeptidase US Patent US9193762 Publication Date 11/24/2015
 
Lysosomal Pro-X carboxypeptidase
Name:Lysosomal Pro-X carboxypeptidase
Type:Enzyme
Mol. Mass.:55805.19
Organism:Homo sapiens (Human)
Description:P42785
Residue:496
BDBM193272
NameBDBM193272
Synonyms:US9193762, RS-33-17
TypeSmall organic molecule
Emp. Form.C26H30BrN3O4
Mol. Mass.528.438
SMILESBrc1ccc(CCNC(=O)[C@@H]2CCCN2C(=O)[C@@H]2CCCN2C(=O)OCc2ccccc2)cc1