Reaction Details
TargetLysosomal Pro-X carboxypeptidase
LigandBDBM193273
Substrate/Competitorn/a
Meas. Tech.Enzyme Assay
Ki 289200±n/a nM
Citation Shariat-Madar, ZRimoldi, JMGadepalli, RS Selective inhibitors of prolylcarboxypeptidase US Patent US9193762 Publication Date 11/24/2015
 
Lysosomal Pro-X carboxypeptidase
Name:Lysosomal Pro-X carboxypeptidase
Type:Enzyme
Mol. Mass.:55805.19
Organism:Homo sapiens (Human)
Description:P42785
Residue:496
BDBM193273
NameBDBM193273
Synonyms:US9193762, RS-33-18
TypeSmall organic molecule
Emp. Form.C23H33N3O4
Mol. Mass.415.5258
SMILESCCCCCNC(=O)[C@@H]1CCCN1C(=O)[C@@H]1CCCN1C(=O)OCc1ccccc1