Reaction Details
TargetLysosomal Pro-X carboxypeptidase
LigandBDBM193284
Substrate/Competitorn/a
Meas. Tech.Enzyme Assay
Ki 2.585e+5±n/a nM
Citation Shariat-Madar, ZRimoldi, JMGadepalli, RS Selective inhibitors of prolylcarboxypeptidase US Patent US9193762 Publication Date 11/24/2015
 
Lysosomal Pro-X carboxypeptidase
Name:Lysosomal Pro-X carboxypeptidase
Type:Enzyme
Mol. Mass.:55805.19
Organism:Homo sapiens (Human)
Description:P42785
Residue:496
BDBM193284
NameBDBM193284
Synonyms:US9193762, RS-37-03
TypeSmall organic molecule
Emp. Form.C24H28ClN3O4
Mol. Mass.457.95
SMILESClc1ccc(CNC(=O)CCCNC(=O)[C@@H]2CCCN2C(=O)OCc2ccccc2)cc1