Reaction Details
TargetLysosomal Pro-X carboxypeptidase
LigandBDBM193288
Substrate/Competitorn/a
Meas. Tech.Activation Assay
Ki 1.929e+5±n/a nM
Citation Shariat-Madar, ZRimoldi, JMGadepalli, RS Selective inhibitors of prolylcarboxypeptidase US Patent US9193762 Publication Date 11/24/2015
 
Lysosomal Pro-X carboxypeptidase
Name:Lysosomal Pro-X carboxypeptidase
Type:Enzyme
Mol. Mass.:55805.19
Organism:Homo sapiens (Human)
Description:P42785
Residue:496
BDBM193288
NameBDBM193288
Synonyms:US9193762, RS-37-07
TypeSmall organic molecule
Emp. Form.C26H41N3O7
Mol. Mass.507.6196
(=O)CCCNC(=O)[C@@H]1CCCN1C(=O)OCc1ccccc1