Reaction Details
TargetBeta-glucuronidase
LigandBDBM193733
Substrate/Competitorn/a
Meas. Tech.β-Glucuronidase Bioassay
IC50 1.2e+2± 1 nM
Citation Taha, MIsmail, NHImran, SRahim, FWadood, AKhan, HUllah, HSalar, UKhan, KM Synthesis, ß-glucuronidase inhibition and molecular docking studies of hybrid bisindole-thiosemicarbazides analogs. Bioorg Chem68:56-63 (2016) 
 
Beta-glucuronidase
Name:Beta-glucuronidase
Type:Protein
Mol. Mass.:74736.05
Organism:Homo sapiens (Human)
Description:n/a
Residue:651
BDBM193733
NameBDBM193733
Synonyms:2-(4-(Di(1H-indol-3-yl)methyl)benzoyl)-N-(3,4-dichlorophenyl)-hydrazinecarbothioamide (16)
TypeSmall organic molecule
Emp. Form.C31H23Cl2N5OS
Mol. Mass.584.518
SMILESClc1ccc(NC(=S)NNC(=O)c2ccc(cc2)C(c2c[nH]c3ccccc23)c2c[nH]c3ccccc23)cc1Cl