Reaction Details
TargetBeta-glucuronidase
LigandBDBM193734
Substrate/Competitorn/a
Meas. Tech.β-Glucuronidase Bioassay
IC50 2e+2± 1 nM
Citation Taha, MIsmail, NHImran, SRahim, FWadood, AKhan, HUllah, HSalar, UKhan, KM Synthesis, ß-glucuronidase inhibition and molecular docking studies of hybrid bisindole-thiosemicarbazides analogs. Bioorg Chem68:56-63 (2016) 
 
Beta-glucuronidase
Name:Beta-glucuronidase
Type:Protein
Mol. Mass.:74736.05
Organism:Homo sapiens (Human)
Description:n/a
Residue:651
BDBM193734
NameBDBM193734
Synonyms:2-(4-(di(1H-indol-3-yl)methyl)benzoyl)-N-(4(trifluoromethyl)phenyl)hydrazinecarbothioamide (17)
TypeSmall organic molecule
Emp. Form.C32H24F3N5OS
Mol. Mass.583.626
SMILESFC(F)(F)c1ccc(NC(=S)NNC(=O)c2ccc(cc2)C(c2c[nH]c3ccccc23)c2c[nH]c3ccccc23)cc1