Reaction Details
TargetCarbonic anhydrase 1
LigandBDBM193744
Substrate/Competitorn/a
Meas. Tech.In vitro Carbonic Anhydrase Inhibition Assay
Ki 522± 103 nM
Citation Mert, SAlim, ZIsgör, MMBeydemir, Å¿Kasimogullari, R The synthesis of novel pyrazole-3,4-dicarboxamides bearing 5-amino-1,3,4-thiadiazole-2-sulfonamide moiety with effective inhibitory activity against the isoforms of human cytosolic carbonic anhydrase I and II. Bioorg Chem68:64-71 (2016) 
 
Carbonic anhydrase 1
Name:Carbonic anhydrase 1
Type:Enzyme
Mol. Mass.:28873.37
Organism:Homo sapiens (Human)
Description:P00915
Residue:261
BDBM193744
NameBDBM193744
Synonyms:tert-Butyl 3-oxo-2-(2-(3-(5-phenyl-3,4-bis((5-sulfamoyl-1,3,4-thiadiazol-2-yl)carbamoyl)-1H-pyrazol-1-yl)phenyl)hydrazono)butanoate (12)
TypeSmall organic molecule
Emp. Form.C29H28N12O9S4
Mol. Mass.816.868
SMILESCC(=O)C(=N\Nc1cccc(c1)-n1nc(C(=O)Nc2nnc(s2)S(N)(=O)=O)c(C(=O)Nc2nnc(s2)S(N)(=O)=O)c1-c1ccccc1)\C(=O)OC(C)(C)C