Reaction Details
TargetCarbonic anhydrase 2
LigandBDBM193741
Substrate/Competitorn/a
Meas. Tech.In vitro Carbonic Anhydrase Inhibition Assay
Ki 435± 108 nM
Citation Mert, SAlim, ZIsgör, MMBeydemir, Å¿Kasimogullari, R The synthesis of novel pyrazole-3,4-dicarboxamides bearing 5-amino-1,3,4-thiadiazole-2-sulfonamide moiety with effective inhibitory activity against the isoforms of human cytosolic carbonic anhydrase I and II. Bioorg Chem68:64-71 (2016) 
 
Carbonic anhydrase 2
Name:Carbonic anhydrase 2
Type:Enzyme
Mol. Mass.:29250.71
Organism:Homo sapiens (Human)
Description:P00918
Residue:260
BDBM193741
NameBDBM193741
Synonyms:Ethyl 3-oxo-3-phenyl-2-(2-(3-(5-phenyl-3,4-bis((5-sulfamoyl-1,3,4-thiadiazol-2-yl)carbamoyl)-1H-pyrazol-1-yl)phenyl)hydrazono)propanoate (9)
TypeSmall organic molecule
Emp. Form.C32H26N12O9S4
Mol. Mass.850.884
SMILESCCOC(=O)C(=N/Nc1cccc(c1)-n1nc(C(=O)Nc2nnc(s2)S(N)(=O)=O)c(C(=O)Nc2nnc(s2)S(N)(=O)=O)c1-c1ccccc1)\C(=O)c1ccccc1