Reaction Details
TargetCarbonic anhydrase 2
LigandBDBM193811
Substrate/Competitorn/a
Meas. Tech.Carbonic Anhydrase (bCAII) Inhibition Assay
pH7.2±n/a
IC50 1.63e+4± 9e+1 nM
Commentsextracted
Citation Imran, STaha, MIsmail, NHFayyaz, SKhan, KMChoudhary, MI Synthesis of novel bisindolylmethanes: New carbonic anhydrase II inhibitors, docking, and 3D pharmacophore studies. Bioorg Chem68:90-104 (2016) 
 
Carbonic anhydrase 2
Name:Carbonic anhydrase 2
Type:Enzyme Catalytic Domain
Mol. Mass.:29115.93
Organism:Bos taurus
Description:n/a
Residue:260
BDBM193811
NameBDBM193811
Synonyms:N-(4-(bis(5-chloro-1H-indol-3-yl)methyl)phenyl)-2,4,5-trichlorobenzenesulfonamide (5f)
TypeSmall organic molecule
Emp. Form.C29H18Cl5N3O2S
Mol. Mass.649.802
SMILESClc1ccc2[nH]cc(C(c3c[nH]c4ccc(Cl)cc34)c3ccc(NS(=O)(=O)c4cc(Cl)c(Cl)cc4Cl)cc3)c2c1