Reaction Details
TargetAcetylcholinesterase
LigandBDBM10441
Substrate/Competitorn/a
Meas. Tech.AChE and BuChE Inhibition Assay
pH8±n/a
IC50 647.6±2.33 nM
Commentsextracted
Citation Yao, DWang, JWang, GJiang, YShang, LZhao, YHuang, JYang, SWang, JYu, Y Design, synthesis and biological evaluation of coumarin derivatives as novel acetylcholinesterase inhibitors that attenuate H2O2-induced apoptosis in SH-SY5Y cells. Bioorg Chem68:112-123 (2016) 
 
Acetylcholinesterase
Name:Acetylcholinesterase
Type:Enzyme
Mol. Mass.:67792.70
Organism:Homo sapiens (Human)
Description:P22303
Residue:614
BDBM10441
NameBDBM10441
Synonyms:(+)-Huperzine A (-)-Huperzine A (1R,13E)-1-amino-13-ethylidene-11-methyl-6-azatricyclo[7.3.1.0^{2,7}]trideca-2(7),3,10-trien-5-one (5S,11E)-5-amino-11-ethylidene-7-methyl-5,6,9,10-tetrahydro-5,9-methanocycloocta[b]pyridin-2(1H)-one | Huperzine A
TypeSmall organic molecule
Emp. Form.C15H18N2O
Mol. Mass.242.3162
SMILESC\C=C1/C2Cc3[nH]c(=O)ccc3C1(N)CC(C)=C2