Reaction Details
TargetMannosyl-oligosaccharide glucosidase
LigandBDBM23406
Substrate/Competitorn/a
Meas. Tech.α-Glucosidase inhibition assay
pH6.8±n/a
IC50 1.334e+4± 1.26e+3 nM
Commentsextracted
Citation Özil, MEmirik, MEtlik, SYÜlker, SKahveci, B A simple and efficient synthesis of novel inhibitors of alpha-glucosidase based on benzimidazole skeleton and molecular docking studies. Bioorg Chem68:226-35 (2016) 
 
Mannosyl-oligosaccharide glucosidase
Name:Mannosyl-oligosaccharide glucosidase
Type:Protein
Mol. Mass.:96475.51
Organism:Saccharomyces cerevisiae (Yeast)
Description:n/a
Residue:833
BDBM23406
NameBDBM23406
Synonyms:(3R,4R,5S,6R)-5-{[(2R,3R,4R,5S,6R)-5-{[(2R,3R,4S,5S,6R)-3,4-dihydroxy-6-methyl-5-{[(1S,4R,5S,6S)-4,5,6-trihydroxy-3-(hydroxymethyl)cyclohex-2-en-1-yl]amino}oxan-2-yl]oxy}-3,4-dihydroxy-6-(hydroxymethyl)oxan-2-yl]oxy}-6-(hydroxymethyl)oxane-2,3,4-triol US11292789, Acarbose
TypeCarbohydrate
Emp. Form.C25H43NO18
Mol. Mass.645.6048
SMILESC[C@H]1O[C@H](O[C@@H]2[C@@H](CO)O[C@H](O[C@@H]3[C@@H](CO)OC(O)[C@H](O)[C@H]3O)[C@H](O)[C@H]2O)[C@H](O)[C@@H](O)[C@@H]1N[C@H]1C=C(CO)[C@@H](O)[C@H](O)[C@H]1O