Reaction Details
TargetMast/stem cell growth factor receptor Kit
LigandBDBM193953
Substrate/Competitorn/a
Meas. Tech.Cell Proliferation Assay
IC50 6±n/a nM
Citation Yeh, VLi, XLiu, XLoren, JMolteni, VNabakka, JNguyen, BPetrassi, HM Compounds and compositions as C-kit kinase inhibitors US Patent US9199981 Publication Date 12/1/2015
 
Mast/stem cell growth factor receptor Kit
Name:Mast/stem cell growth factor receptor Kit
Type:Protein
Mol. Mass.:109869.37
Organism:Homo sapiens (Human)
Description:P10721
Residue:976
BDBM193953
NameBDBM193953
Synonyms:US9199981, F44
TypeSmall organic molecule
Emp. Form.C28H27F2N7O3
Mol. Mass.547.5559
SMILESCc1ccc(cc1NC(=O)c1cnc2ccc(cn12)-c1cnn(CC(C)(C)O)c1)-c1noc(n1)C1CC(F)(F)C1