Reaction Details
TargetTyrosine-protein kinase BTK/Lyn
LigandBDBM194087
Substrate/Competitorn/a
Meas. Tech.Z'-LYTE Kinase Assay
Temperature303.15±n/a K
IC50 1662±0.0 nM
Commentsextracted
Citation Yamamoto, SYoshizawa, T Purinone derivative hydrochloride US Patent US9199997 Publication Date 12/1/2015
 
Tyrosine-protein kinase BTK/Lyn
Name:Tyrosine-protein kinase BTK/Lyn
Synonyms:LynA/BTK
Type:Protein
Mol. Mass.:n/a
Description:n/a
Components:This complex has 2 components.
Component 1
Name:Tyrosine-protein kinase Lyn
Type:Protein
Mol. Mass.:58575.92
Organism:Homo sapiens (Human)
Description:P07948
Residue:512
Component 2
Name:Tyrosine-protein kinase BTK
Synonyms:AGMX1 Agammaglobulinaemia tyrosine kinase B cell progenitor kinase BPK BTK_HUMAN Tyrosine Kinase BTK Tyrosine-protein kinase BTK (BTK)
Type:Enzyme
Mol. Mass.:76289.95
Organism:Homo sapiens (Human)
Description:Q06187
Residue:659
BDBM194087
NameBDBM194087
Synonyms:US20230364079, Example Tirabrutinib US9879013, 19(2)
TypeSmall organic molecule
Emp. Form.C25H22N6O3
Mol. Mass.454.4806
SMILESCC#CC(=O)N1CC[C@H](C1)n1c2ncnc(N)c2n(-c2ccc(Oc3ccccc3)cc2)c1=O