Reaction Details
TargetIsoform PDE10A2 of cAMP and cAMP-inhibited cGMP 3',5'-cyclic phosphodiesterase 10A (PDE10A2)
LigandBDBM194095
Substrate/Competitorn/a
Meas. Tech.Fluorescence Polarization Assay
Ki 0.028±n/a nM
Citation Cox, CDDudkin, VYKim, JJKuduk, SDMcVean, CAReger, TSheen, JTSteele, T Triazolyl PDE10 inhibitors US Patent US9200001 Publication Date 12/1/2015
 
Isoform PDE10A2 of cAMP and cAMP-inhibited cGMP 3',5'-cyclic phosphodiesterase 10A (PDE10A2)
Name:Isoform PDE10A2 of cAMP and cAMP-inhibited cGMP 3',5'-cyclic phosphodiesterase 10A (PDE10A2)
Type:Enzyme
Mol. Mass.:89387.03
Organism:Homo sapiens (Human)
Description:Q9Y233-2
Residue:789
BDBM194095
NameBDBM194095
Synonyms:US9200001, 8
TypeSmall organic molecule
Emp. Form.C27H27N7O2
Mol. Mass.481.549
SMILESCOc1ccc(Cc2nc(C)nn2-c2cc(CCc3ccc4ccccc4n3)nc(C)n2)nc1OC