Reaction Details
TargetIsoform PDE10A2 of cAMP and cAMP-inhibited cGMP 3',5'-cyclic phosphodiesterase 10A (PDE10A2)
LigandBDBM194126
Substrate/Competitorn/a
Meas. Tech.Fluorescence Polarization Assay
Ki 0.5±n/a nM
Citation Cox, CDDudkin, VYKim, JJKuduk, SDMcVean, CAReger, TSheen, JTSteele, T Triazolyl PDE10 inhibitors US Patent US9200001 Publication Date 12/1/2015
 
Isoform PDE10A2 of cAMP and cAMP-inhibited cGMP 3',5'-cyclic phosphodiesterase 10A (PDE10A2)
Name:Isoform PDE10A2 of cAMP and cAMP-inhibited cGMP 3',5'-cyclic phosphodiesterase 10A (PDE10A2)
Type:Enzyme
Mol. Mass.:89387.03
Organism:Homo sapiens (Human)
Description:Q9Y233-2
Residue:789
BDBM194126
NameBDBM194126
Synonyms:US9200001, 42
TypeSmall organic molecule
Emp. Form.C26H29N7O2
Mol. Mass.471.5542
SMILESCOc1ccc(Cc2nc(C)nn2-c2cc(nc(C)n2)C2CC2c2cc3CCCn3n2)cc1OC