Reaction Details
TargetIsoform PDE10A2 of cAMP and cAMP-inhibited cGMP 3',5'-cyclic phosphodiesterase 10A (PDE10A2)
LigandBDBM194133
Substrate/Competitorn/a
Meas. Tech.Fluorescence Polarization Assay
Ki 0.21±n/a nM
Citation Cox, CDDudkin, VYKim, JJKuduk, SDMcVean, CAReger, TSheen, JTSteele, T Triazolyl PDE10 inhibitors US Patent US9200001 Publication Date 12/1/2015
 
Isoform PDE10A2 of cAMP and cAMP-inhibited cGMP 3',5'-cyclic phosphodiesterase 10A (PDE10A2)
Name:Isoform PDE10A2 of cAMP and cAMP-inhibited cGMP 3',5'-cyclic phosphodiesterase 10A (PDE10A2)
Type:Enzyme
Mol. Mass.:89387.03
Organism:Homo sapiens (Human)
Description:Q9Y233-2
Residue:789
BDBM194133
NameBDBM194133
Synonyms:US9200001, 49
TypeSmall organic molecule
Emp. Form.C24H24N6
Mol. Mass.396.4876
SMILESCc1nc(Cc2ccccc2)n(n1)-c1cc(nc(C)n1)C1CC1c1ccc(C)cn1