Reaction Details
TargetIsoform PDE10A2 of cAMP and cAMP-inhibited cGMP 3',5'-cyclic phosphodiesterase 10A (PDE10A2)
LigandBDBM194176
Substrate/Competitorn/a
Meas. Tech.Fluorescence Polarization Assay
Ki 0.4±n/a nM
Citation Cox, CDDudkin, VYKim, JJKuduk, SDMcVean, CAReger, TSheen, JTSteele, T Triazolyl PDE10 inhibitors US Patent US9200001 Publication Date 12/1/2015
 
Isoform PDE10A2 of cAMP and cAMP-inhibited cGMP 3',5'-cyclic phosphodiesterase 10A (PDE10A2)
Name:Isoform PDE10A2 of cAMP and cAMP-inhibited cGMP 3',5'-cyclic phosphodiesterase 10A (PDE10A2)
Type:Enzyme
Mol. Mass.:89387.03
Organism:Homo sapiens (Human)
Description:Q9Y233-2
Residue:789
BDBM194176
NameBDBM194176
Synonyms:US9200001, 92
TypeSmall organic molecule
Emp. Form.C21H23N7
Mol. Mass.373.4542
SMILESCCc1nc(C)nn1-c1cc(nc(C)n1)[C@@H]1C[C@H]1c1nc2ccccc2n1C