Reaction Details
TargetHypoxanthine-guanine phosphoribosyltransferase
LigandBDBM194497
Substrate/Competitorn/a
Meas. Tech.Spectrophotometric Assay
pH7.4±n/a
Ki 600±100 nM
Commentsextracted
Citation De Jersey, JGuddat, LWHockova, DKeough, DT 6-oxopurine phosphoribosyltransferase inhibitors US Patent US9200020 Publication Date 12/1/2015
 
Hypoxanthine-guanine phosphoribosyltransferase
Name:Hypoxanthine-guanine phosphoribosyltransferase
Type:Protein
Mol. Mass.:24579.61
Organism:Homo sapiens (Human)
Description:P00492
Residue:218
BDBM194497
NameBDBM194497
Synonyms:US9200020, Table 3 compound 6
TypeSmall organic molecule
Emp. Form.C13H21N7O4P
Mol. Mass.370.3241
SMILESNc1nc2n(CCN(CCCC#N)CCP(O)(O)=O)c[nH]c2c(=O)[nH]1