Reaction Details
TargetHypoxanthine-guanine phosphoribosyltransferase
LigandBDBM194498
Substrate/Competitorn/a
Meas. Tech.Spectrophotometric Assay
pH7.4±n/a
Ki 1400±200 nM
Commentsextracted
Citation De Jersey, JGuddat, LWHockova, DKeough, DT 6-oxopurine phosphoribosyltransferase inhibitors US Patent US9200020 Publication Date 12/1/2015
 
Hypoxanthine-guanine phosphoribosyltransferase
Name:Hypoxanthine-guanine phosphoribosyltransferase
Type:Protein
Mol. Mass.:24579.61
Organism:Homo sapiens (Human)
Description:P00492
Residue:218
BDBM194498
NameBDBM194498
Synonyms:US9200020, Table 3 compound 7
TypeSmall organic molecule
Emp. Form.C11H18N6O6P
Mol. Mass.361.271
SMILESNc1nc2n(CCN(CCP(O)(O)=O)CC(O)=O)c[nH]c2c(=O)[nH]1