Reaction Details
TargetXanthine-guanine phosphoribosyltransferase
LigandBDBM194504
Substrate/Competitorn/a
Meas. Tech.Spectrophotometric Assay
pH7.4±n/a
Ki 27000±n/a nM
Commentsextracted
Citation De Jersey, JGuddat, LWHockova, DKeough, DT 6-oxopurine phosphoribosyltransferase inhibitors US Patent US9200020 Publication Date 12/1/2015
 
Xanthine-guanine phosphoribosyltransferase
Name:Xanthine-guanine phosphoribosyltransferase
Type:Enzyme
Mol. Mass.:16968.37
Organism:Escherichia coli (strain K12)
Description:P0A9M5
Residue:152
BDBM194504
NameBDBM194504
Synonyms:US9200020, 2
TypeSmall organic molecule
Emp. Form.C10H18N6O7P2
Mol. Mass.396.2334
SMILESNc1nc2n(CCN(CCP(O)(O)=O)CP(O)(O)=O)cnc2c(=O)[nH]1