Reaction Details
TargetC-X-C chemokine receptor type 4
LigandBDBM194547
Substrate/Competitorn/a
Meas. Tech.Competitive Binding Assay
IC50>100±n/a nM
Citation Natchus, MGArrendale, RLiotta, D Tricyclic amino containing compounds for treatment or prevention of symptoms associated with endocrine dysfunction US Patent US9205085 Publication Date 12/8/2015
 
C-X-C chemokine receptor type 4
Name:C-X-C chemokine receptor type 4
Type:Enzyme
Mol. Mass.:39342.13
Organism:Rattus norvegicus (Rat)
Description:O08565
Residue:349
BDBM194547
NameBDBM194547
Synonyms:US9205085, MSX- 176
TypeSmall organic molecule
Emp. Form.C20H20N2
Mol. Mass.288.3862
SMILESC(Nc1ccccc1)c1ccccc1CNc1ccccc1