Reaction Details
TargetC-X-C chemokine receptor type 4
LigandBDBM194518
Substrate/Competitorn/a
Meas. Tech.Competitive Binding Assay
IC50<10±n/a nM
Citation Natchus, MGArrendale, RLiotta, D Tricyclic amino containing compounds for treatment or prevention of symptoms associated with endocrine dysfunction US Patent US9205085 Publication Date 12/8/2015
 
C-X-C chemokine receptor type 4
Name:C-X-C chemokine receptor type 4
Type:Enzyme
Mol. Mass.:39342.13
Organism:Rattus norvegicus (Rat)
Description:O08565
Residue:349
BDBM194518
NameBDBM194518
Synonyms:BDBM194554 | US9205085, MSX- 183
TypeSmall organic molecule
Emp. Form.C20H18F2N2
Mol. Mass.324.3671
SMILESFc1ccccc1NCc1ccc(CNc2ccccc2F)cc1