Reaction Details
TargetC-X-C chemokine receptor type 4
LigandBDBM194561
Substrate/Competitorn/a
Meas. Tech.Competitive Binding Assay
IC50 1±n/a nM
Citation Natchus, MGArrendale, RLiotta, D Tricyclic amino containing compounds for treatment or prevention of symptoms associated with endocrine dysfunction US Patent US9205085 Publication Date 12/8/2015
 
C-X-C chemokine receptor type 4
Name:C-X-C chemokine receptor type 4
Type:Enzyme
Mol. Mass.:39342.13
Organism:Rattus norvegicus (Rat)
Description:O08565
Residue:349
BDBM194561
NameBDBM194561
Synonyms:US9205085, MSX- 192
TypeSmall organic molecule
Emp. Form.C16H12Cl2F2N6
Mol. Mass.397.209
SMILESFc1cnc(NCc2ccc(CNc3ncc(F)c(Cl)n3)cc2)nc1Cl