Reaction Details
TargetC-X-C chemokine receptor type 4
LigandBDBM194562
Substrate/Competitorn/a
Meas. Tech.Competitive Binding Assay
IC50 1±n/a nM
Citation Natchus, MGArrendale, RLiotta, D Tricyclic amino containing compounds for treatment or prevention of symptoms associated with endocrine dysfunction US Patent US9205085 Publication Date 12/8/2015
 
C-X-C chemokine receptor type 4
Name:C-X-C chemokine receptor type 4
Type:Enzyme
Mol. Mass.:39342.13
Organism:Rattus norvegicus (Rat)
Description:O08565
Residue:349
BDBM194562
NameBDBM194562
Synonyms:US9205085, MSX- 193
TypeSmall organic molecule
Emp. Form.C16H14F2N6
Mol. Mass.328.3194
SMILESFc1nccc(NCc2ccc(CNc3ccnc(F)n3)cc2)n1