Reaction Details
TargetC-X-C chemokine receptor type 4
LigandBDBM194564
Substrate/Competitorn/a
Meas. Tech.Competitive Binding Assay
IC50 100±n/a nM
Citation Natchus, MGArrendale, RLiotta, D Tricyclic amino containing compounds for treatment or prevention of symptoms associated with endocrine dysfunction US Patent US9205085 Publication Date 12/8/2015
 
C-X-C chemokine receptor type 4
Name:C-X-C chemokine receptor type 4
Type:Enzyme
Mol. Mass.:39342.13
Organism:Rattus norvegicus (Rat)
Description:O08565
Residue:349
BDBM194564
NameBDBM194564
Synonyms:US9205085, MSX- 196
TypeSmall organic molecule
Emp. Form.C18H17FN4
Mol. Mass.308.3528
SMILESFc1ccccc1NCc1ccc(CNc2ncccn2)cc1