Reaction Details
TargetC-X-C chemokine receptor type 4
LigandBDBM194565
Substrate/Competitorn/a
Meas. Tech.Competitive Binding Assay
IC50 1±n/a nM
Citation Natchus, MGArrendale, RLiotta, D Tricyclic amino containing compounds for treatment or prevention of symptoms associated with endocrine dysfunction US Patent US9205085 Publication Date 12/8/2015
 
C-X-C chemokine receptor type 4
Name:C-X-C chemokine receptor type 4
Type:Enzyme
Mol. Mass.:39342.13
Organism:Rattus norvegicus (Rat)
Description:O08565
Residue:349
BDBM194565
NameBDBM194565
Synonyms:US9205085, MSX- 197
TypeSmall organic molecule
Emp. Form.C17H16FN5
Mol. Mass.309.3408
SMILESFc1ccc(NCc2ccc(CNc3ncccn3)cc2)nc1