Reaction Details
TargetC-X-C chemokine receptor type 4
LigandBDBM194570
Substrate/Competitorn/a
Meas. Tech.Competitive Binding Assay
IC50 1±n/a nM
Citation Natchus, MGArrendale, RLiotta, D Tricyclic amino containing compounds for treatment or prevention of symptoms associated with endocrine dysfunction US Patent US9205085 Publication Date 12/8/2015
 
C-X-C chemokine receptor type 4
Name:C-X-C chemokine receptor type 4
Type:Enzyme
Mol. Mass.:39342.13
Organism:Rattus norvegicus (Rat)
Description:O08565
Residue:349
BDBM194570
NameBDBM194570
Synonyms:US9205085, MSX- 203
TypeSmall organic molecule
Emp. Form.C20H18N4O4
Mol. Mass.378.3813
SMILES[O-][N+](=O)c1cccc(NCc2ccc(CNc3cccc(c3)[N+]([O-])=O)cc2)c1