Reaction Details
TargetC-X-C chemokine receptor type 4
LigandBDBM194578
Substrate/Competitorn/a
Meas. Tech.Competitive Binding Assay
IC50 100±n/a nM
Citation Natchus, MGArrendale, RLiotta, D Tricyclic amino containing compounds for treatment or prevention of symptoms associated with endocrine dysfunction US Patent US9205085 Publication Date 12/8/2015
 
C-X-C chemokine receptor type 4
Name:C-X-C chemokine receptor type 4
Type:Enzyme
Mol. Mass.:39342.13
Organism:Rattus norvegicus (Rat)
Description:O08565
Residue:349
BDBM194578
NameBDBM194578
Synonyms:US9205085, MSX- 212
TypeSmall organic molecule
Emp. Form.C17H16N4O
Mol. Mass.292.3351
SMILESC(Nc1ncccn1)c1ccc(COc2ccccn2)cc1