Reaction Details
TargetTransitional endoplasmic reticulum ATPase
LigandBDBM194606
Substrate/Competitorn/a
Meas. Tech.Inhibition Assay
pH8±n/a
Temperature310.15±n/a K
IC50 274±n/a nM
Commentsextracted
Citation Kakizuka, AHori, SIkeda, HYoshimura, NNakano, NShudo, TFuchigami, T Agent for treatment of eye diseases US Patent US9206129 Publication Date 12/8/2015
 
Transitional endoplasmic reticulum ATPase
Name:Transitional endoplasmic reticulum ATPase
Type:Protein
Mol. Mass.:89300.63
Organism:Mus musculus (Mouse)
Description:Q01853
Residue:806
BDBM194606
NameBDBM194606
Synonyms:US9206129, 22
TypeSmall organic molecule
Emp. Form.C23H19N4NaO3S
Mol. Mass.454.477
SMILESCc1ccc(C)c(c1)-c1ccc(cn1)\N=N\c1cc(c2ccccc2c1N)S(=O)(=O)O[Na]