Reaction Details
TargetTransitional endoplasmic reticulum ATPase
LigandBDBM194628
Substrate/Competitorn/a
Meas. Tech.Inhibition Assay
pH8±n/a
Temperature310.15±n/a K
IC50 232±n/a nM
Commentsextracted
Citation Kakizuka, AHori, SIkeda, HYoshimura, NNakano, NShudo, TFuchigami, T Agent for treatment of eye diseases US Patent US9206129 Publication Date 12/8/2015
 
Transitional endoplasmic reticulum ATPase
Name:Transitional endoplasmic reticulum ATPase
Type:Protein
Mol. Mass.:89300.63
Organism:Mus musculus (Mouse)
Description:Q01853
Residue:806
BDBM194628
NameBDBM194628
Synonyms:US9206129, 44
TypeSmall organic molecule
Emp. Form.C24H21N4NaO5S
Mol. Mass.500.502
SMILESNc1c(cc(c2ccccc12)S(=O)(=O)O[Na])\N=N\c1ccc(nc1)-c1ccccc1OCCCO