Reaction Details
TargetADAM metallopeptidase with thrombospondin type 1 motif, 5
LigandBDBM194639
Substrate/Competitorn/a
Meas. Tech.Shift AlphaScreen Assay
IC50 20±n/a nM
Citation Durham, TBMarimuthu, JWiley, MR Aggrecanase inhibitors US Patent US9206139 Publication Date 12/8/2015
 
ADAM metallopeptidase with thrombospondin type 1 motif, 5
Name:ADAM metallopeptidase with thrombospondin type 1 motif, 5
Synonyms:Metalloproteinase with thrombospondin motifs 5 (ADAMTS-5)
Type:Enzyme
Mol. Mass.:101805.04
Organism:Rattus norvegicus (Rat)
Description:G3V673
Residue:927
BDBM194639
NameBDBM194639
Synonyms:US9206139, 2
TypeSmall organic molecule
Emp. Form.C19H22F3N3O3
Mol. Mass.397.3915
SMILESCC[C@H](Cc1ccc(cc1)C(F)(F)F)C(=O)NC[C@]1(NC(=O)NC1=O)C1CC1