Reaction Details
TargetInterstitial collagenase
LigandBDBM194644
Substrate/Competitorn/a
Meas. Tech.In Vitro Fluorescence Assay
pH7.5±n/a
IC50 39200±n/a nM
Commentsextracted
Citation Durham, TBMarimuthu, JWiley, MR Aggrecanase inhibitors US Patent US9206139 Publication Date 12/8/2015
 
Interstitial collagenase
Name:Interstitial collagenase
Type:Enzyme
Mol. Mass.:54010.26
Organism:Homo sapiens (Human)
Description: P03956
Residue:469
BDBM194644
NameBDBM194644
Synonyms:US9206139, 3
TypeSmall organic molecule
Emp. Form.C20H22F3N3O3
Mol. Mass.409.4022
SMILESFC(F)(F)c1ccc(C[C@@H](C2CC2)C(=O)NC[C@]2(NC(=O)NC2=O)C2CC2)cc1