Reaction Details
TargetInterstitial collagenase
LigandBDBM194646
Substrate/Competitorn/a
Meas. Tech.In Vitro Fluorescence Assay
pH7.5±n/a
IC50 4550±n/a nM
Commentsextracted
Citation Durham, TBMarimuthu, JWiley, MR Aggrecanase inhibitors US Patent US9206139 Publication Date 12/8/2015
 
Interstitial collagenase
Name:Interstitial collagenase
Type:Enzyme
Mol. Mass.:54010.26
Organism:Homo sapiens (Human)
Description: P03956
Residue:469
BDBM194646
NameBDBM194646
Synonyms:US9206139, 5
TypeSmall organic molecule
Emp. Form.C19H22F3N3O3
Mol. Mass.397.3915
SMILESCC(C)(Cc1ccc(cc1)C(F)(F)F)C(=O)NC[C@]1(NC(=O)NC1=O)C1CC1