Reaction Details
TargetMacrophage metalloelastase
LigandBDBM194644
Substrate/Competitorn/a
Meas. Tech.In Vitro Fluorescence Assay
pH7.5±n/a
IC50 268±n/a nM
Commentsextracted
Citation Durham, TBMarimuthu, JWiley, MR Aggrecanase inhibitors US Patent US9206139 Publication Date 12/8/2015
 
Macrophage metalloelastase
Name:Macrophage metalloelastase
Type:Enzyme
Mol. Mass.:54012.99
Organism:Homo sapiens (Human)
Description:P39900
Residue:470
BDBM194644
NameBDBM194644
Synonyms:US9206139, 3
TypeSmall organic molecule
Emp. Form.C20H22F3N3O3
Mol. Mass.409.4022
SMILESFC(F)(F)c1ccc(C[C@@H](C2CC2)C(=O)NC[C@]2(NC(=O)NC2=O)C2CC2)cc1