Reaction Details
TargetD(2) dopamine receptor
LigandBDBM194785
Substrate/Competitorn/a
Meas. Tech.Dopamine D2 Receptor Binding Assay
pH7.4±n/a
Temperature298.15±n/a K
Ki 0.8±n/a nM
Commentsextracted
Citation Yamashita, HIto, NMiyamura, SOshima, KMatsubara, JKuroda, HTakahashi, HShimizu, STanaka, T Piperazine-substituted benzothiophenes for treatment of mental disorders US Patent US9206167 Publication Date 12/8/2015
 
D(2) dopamine receptor
Name:D(2) dopamine receptor
Type:G Protein-Coupled Receptor (GPCR)
Mol. Mass.:50931.60
Organism:Rattus norvegicus (rat)
Description:P61169
Residue:444
BDBM194785
NameBDBM194785
Synonyms:US9206167, 6 | USRE48059, Compound of Example 6
TypeSmall organic molecule
Emp. Form.C26H29N3O2S
Mol. Mass.447.592
SMILESCc1cc2ccc(OCCCCN3CCN(CC3)c3cccc4sccc34)cc2[nH]c1=O