Reaction Details
TargetBeta-secretase 1 [1-458]
LigandBDBM195129
Substrate/Competitorn/a
Meas. Tech.BACE Enzyme Assay (Ex.434)
pH4.5±n/a
Temperature298.15±n/a K
IC50 2.9±n/a nM
Commentsextracted
Citation Cacatian, SClaremon, DADillard, LWFuchs, KHeine, NJia, LLeftheris, KMcKeever, BMorales-Ramos, ASingh, SBVenkatraman, SWu, GWu, ZXu, ZYuan, JZheng, Y Inhibitors of beta-secretase US Patent US9212153 Publication Date 12/15/2015
 
Beta-secretase 1 [1-458]
Name:Beta-secretase 1 [1-458]
Type:n/a
Mol. Mass.:50753.53
Organism:Homo sapiens (Human)
Description:Truncation 1-458 aa with His-tag at C-terminus
Residue:458
BDBM195129
NameBDBM195129
Synonyms:US10336717, Compound 189 | US9212153, 189,Ex. 150
TypeSmall organic molecule
Emp. Form.C23H25FN4O2
Mol. Mass.408.4686
SMILESCOC1CCC2(Cc3ccc(cc3C22N=C(N)N(C)C2=O)-c2cccnc2F)CC1