Reaction Details
TargetBeta-secretase 1 [1-458]
LigandBDBM195316
Substrate/Competitorn/a
Meas. Tech.BACE Enzyme Assay (Ex.434)
pH4.5±n/a
Temperature298.15±n/a K
IC50 1.4±n/a nM
Commentsextracted
Citation Cacatian, SClaremon, DADillard, LWFuchs, KHeine, NJia, LLeftheris, KMcKeever, BMorales-Ramos, ASingh, SBVenkatraman, SWu, GWu, ZXu, ZYuan, JZheng, Y Inhibitors of beta-secretase US Patent US9212153 Publication Date 12/15/2015
 
Beta-secretase 1 [1-458]
Name:Beta-secretase 1 [1-458]
Type:n/a
Mol. Mass.:50753.53
Organism:Homo sapiens (Human)
Description:Truncation 1-458 aa with His-tag at C-terminus
Residue:458
BDBM195316
NameBDBM195316
Synonyms:US9212153, 394,Ex. 335
TypeSmall organic molecule
Emp. Form.C27H26N4O
Mol. Mass.422.5215
SMILESCN1C(N)=NC2(C1=O)c1cc(ccc1CC21CCc2ccccc2CC1)-c1cccnc1