Reaction Details
TargetLysophospholipase-like protein 1
LigandBDBM195575
Substrate/Competitorn/a
Meas. Tech.Gel-based ABPP (LYPLAL1)
pH7.5±n/a
IC50 7±n/a nM
Commentsextracted
Citation Ahn, KBoehm, MBrown, MFCalloway, JChe, YChen, JFennell, KFGeoghegan, KFGilbert, AMGutierrez, JAKalgutkar, ASLanba, ALimberakis, CMagee, TVO'Doherty, IOliver, RPabst, BPandit, JParris, KPfefferkorn, JARolph, TPPatel, RSchuff, BShanmugasundaram, VStarr, JTVarghese, AHVera, NBVernochet, CYan, J Discovery of a Selective Covalent Inhibitor of Lysophospholipase-like 1 (LYPLAL1) as a Tool to Evaluate the Role of this Serine Hydrolase in Metabolism. ACS Chem Biol11:2529-40 (2016) 
 
Lysophospholipase-like protein 1
Name:Lysophospholipase-like protein 1
Type:Protein
Mol. Mass.:26322.18
Organism:Homo sapiens (Human)
Description:n/a
Residue:237
BDBM195575
NameBDBM195575
Synonyms:(R)-(3-(4-(2-morpholinopyrimidin-5-yl)phenyl)-1H-1,2,4-triazol-1-yl)(2-phenylpiperidin-1-yl)methanone (6)
TypeSmall organic molecule
Emp. Form.C28H29N7O2
Mol. Mass.495.5756
SMILESO=C(N1CCCC[C@@H]1c1ccccc1)n1cnc(n1)-c1ccc(cc1)-c1cnc(nc1)N1CCOCC1