Reaction Details
TargetLiver carboxylesterase 1
LigandBDBM195574
Substrate/Competitorn/a
Meas. Tech.Gel-based ABPP (CES1)
pH7.5±n/a
IC50 5±n/a nM
Commentsextracted
Citation Ahn, KBoehm, MBrown, MFCalloway, JChe, YChen, JFennell, KFGeoghegan, KFGilbert, AMGutierrez, JAKalgutkar, ASLanba, ALimberakis, CMagee, TVO'Doherty, IOliver, RPabst, BPandit, JParris, KPfefferkorn, JARolph, TPPatel, RSchuff, BShanmugasundaram, VStarr, JTVarghese, AHVera, NBVernochet, CYan, J Discovery of a Selective Covalent Inhibitor of Lysophospholipase-like 1 (LYPLAL1) as a Tool to Evaluate the Role of this Serine Hydrolase in Metabolism. ACS Chem Biol11:2529-40 (2016) 
 
Liver carboxylesterase 1
Name:Liver carboxylesterase 1
Type:Protein
Mol. Mass.:62520.83
Organism:Homo sapiens (Human)
Description:n/a
Residue:567
BDBM195574
NameBDBM195574
Synonyms:(R)-(2-phenylpiperidin-1-yl)(3-(4-(pyridin-3-yl)phenyl)-1H-1,2,4-triazol-1-yl)methanone (5)
TypeSmall organic molecule
Emp. Form.C25H23N5O
Mol. Mass.409.483
SMILESO=C(N1CCCC[C@@H]1c1ccccc1)n1cnc(n1)-c1ccc(cc1)-c1cccnc1