Reaction Details
TargetLiver carboxylesterase 1
LigandBDBM195581
Substrate/Competitorn/a
Meas. Tech.Gel-based ABPP (CES1)
pH7.5±n/a
IC50>5.0e+4±n/a nM
Commentsextracted
Citation Ahn, KBoehm, MBrown, MFCalloway, JChe, YChen, JFennell, KFGeoghegan, KFGilbert, AMGutierrez, JAKalgutkar, ASLanba, ALimberakis, CMagee, TVO'Doherty, IOliver, RPabst, BPandit, JParris, KPfefferkorn, JARolph, TPPatel, RSchuff, BShanmugasundaram, VStarr, JTVarghese, AHVera, NBVernochet, CYan, J Discovery of a Selective Covalent Inhibitor of Lysophospholipase-like 1 (LYPLAL1) as a Tool to Evaluate the Role of this Serine Hydrolase in Metabolism. ACS Chem Biol11:2529-40 (2016) 
 
Liver carboxylesterase 1
Name:Liver carboxylesterase 1
Type:Protein
Mol. Mass.:62520.83
Organism:Homo sapiens (Human)
Description:n/a
Residue:567
BDBM195581
NameBDBM195581
Synonyms:(2R,3R)-2-(3-ethynylphenyl)-1-(3-(4-(2-morpholinopyrimidin-5-yl)phenyl)-1H-1,2,4-triazole-1-carbonyl)piperidine-3-carboxylic acid (12)
TypeSmall organic molecule
Emp. Form.C31H29N7O4
Mol. Mass.563.6065
SMILESOC(=O)[C@@H]1CCCN([C@H]1c1cccc(c1)C#C)C(=O)n1cnc(n1)-c1ccc(cc1)-c1cnc(nc1)N1CCOCC1